Target
Endoplasmic reticulum aminopeptidase 2
Ligand
BDBM50076744
Substrate
Meas. Tech.
ChEMBL_1473169 (CHEMBL3418221)
IC50
11±n/a nM
Citation
 Papakyriakou, AZervoudi, ETsoukalidou, SMauvais, FXSfyroera, GMastellos, DCvan Endert, PTheodorakis, EAVourloumis, DStratikos, E 3,4-diaminobenzoic acid derivatives as inhibitors of the oxytocinase subfamily of M1 aminopeptidases with immune-regulating properties. J Med Chem 58:1524-43 (2015)  
Target
Name:
Endoplasmic reticulum aminopeptidase 2
Synonyms:
Aminopeptidase ERAP2_HUMAN | LRAP
Type:
PROTEIN
Mol. Mass.:
110463.90
Organism:
Homo sapiens (Human)
Description:
ChEMBL_1473169
Residue:
960
  
Inhibitor
Name:
BDBM50076744
Synonyms:
CHEMBL3416733
Type:
Small organic molecule
Emp. Form.:
C27H37N4O4P
Mol. Mass.:
512.5808
SMILES:
CC(C)C[C@H](CP(O)(=O)[C@@H](N)CCc1ccccc1)C(=O)N[C@@H](Cc1c[nH]c2ccccc12)C(N)=O
: