Target
Vasopressin V1b receptor
Ligand
BDBM50077138
Substrate
Meas. Tech.
ChEMBL_1474009 (CHEMBL3419769)
Kd
>1000±n/a nM
Citation
 Karpenko, IAMargathe, JFRodriguez, TPflimlin, EDupuis, EHibert, MDurroux, TBonnet, D Selective nonpeptidic fluorescent ligands for oxytocin receptor: design, synthesis, and application to time-resolved FRET binding assay. J Med Chem 58:2547-52 (2015)  
Target
Name:
Vasopressin V1b receptor
Synonyms:
AVPR V1b AVPR1B Antidiuretic hormone receptor 1b V1bR VPR3 Vasopressin V1b receptor (V1b) Vasopressin V3 receptor
Type:
Enzyme
Mol. Mass.:
46985.01
Organism:
Homo sapiens (Human)
Description:
P47901
Residue:
424
  
Inhibitor
Name:
BDBM50077138
Synonyms:
CHEMBL3416753
Type:
Small organic molecule
Emp. Form.:
C60H71ClF4N8O15S2
Mol. Mass.:
1319.827
SMILES:
[O-]C(=O)C(F)(F)F.CCN1\C(=C/C=C/C=C/C2=[N+](CC)c3cc(ccc3C2(C)C)S([O-])(=O)=O)C(C)(CCCC(=O)NCCOCCOCCOCCOCc2nnc(N3CC(C3)Oc3ccc(F)cc3Cl)n2-c2ccc(OC)[nH+]c2)c2cc(ccc12)S(O)(=O)=O
: