Target
Oxytocin receptor
Ligand
BDBM50077140
Substrate
Meas. Tech.
ChEMBL_1474014 (CHEMBL3419774)
Ki
6.2±n/a nM
Citation
 Karpenko, IAMargathe, JFRodriguez, TPflimlin, EDupuis, EHibert, MDurroux, TBonnet, D Selective nonpeptidic fluorescent ligands for oxytocin receptor: design, synthesis, and application to time-resolved FRET binding assay. J Med Chem 58:2547-52 (2015)  
Target
Name:
Oxytocin receptor
Synonyms:
OT-R OXYR_HUMAN | Oxytocin
Type:
Enzyme Catalytic Domain
Mol. Mass.:
42793.26
Organism:
Homo sapiens (Human)
Description:
Oxytocin OXTR HEK293::B2R9L7
Residue:
389
  
Inhibitor
Name:
BDBM50077140
Synonyms:
CHEMBL3416757
Type:
Small organic molecule
Emp. Form.:
C24H24N6O
Mol. Mass.:
412.487
SMILES:
Cc1ccn(Cc2ccc(cc2C)C(=O)N2Cc3cnn(C)c3Nc3ccccc23)n1
: