Target
Vasopressin V1a receptor
Ligand
BDBM50077223
Substrate
Meas. Tech.
ChEMBL_1473355 (CHEMBL3419315)
Ki
0.500000±n/a nM
Citation
 Ratni, HRogers-Evans, MBissantz, CGrundschober, CMoreau, JLSchuler, FFischer, HAlvarez Sanchez, RSchnider, P Discovery of highly selective brain-penetrant vasopressin 1a antagonists for the potential treatment of autism via a chemogenomic and scaffold hopping approach. J Med Chem 58:2275-89 (2015)  
Target
Name:
Vasopressin V1a receptor
Synonyms:
AVPR V1a AVPR1A V1AR_HUMAN VASOPRESSIN V1A Vasopressin V1 receptor Vasopressin receptor
Type:
Receptor
Mol. Mass.:
46820.18
Organism:
Homo sapiens (Human)
Description:
P37288
Residue:
418
  
Inhibitor
Name:
BDBM50077223
Synonyms:
CHEMBL3416881
Type:
Small organic molecule
Emp. Form.:
C25H26ClN3O3
Mol. Mass.:
451.945
SMILES:
CN(C)C(=O)Cn1cc(C(=O)N2CCC3(CC2)OCc2ccccc32)c2ccc(Cl)cc12
: