Target
C-C chemokine receptor type 2
Ligand
BDBM50077980
Substrate
Meas. Tech.
ChEMBL_1473182 (CHEMBL3418234)
Ki
1.6±n/a nM
Citation
 Vilums, MZweemer, AJBarmare, Fvan der Gracht, AMBleeker, DCYu, Zde Vries, HGross, RClemens, JKrenitsky, PBrussee, JStamos, DSaunders, JHeitman, LHIJzerman, AP When structure-affinity relationships meet structure-kinetics relationships: 3-((Inden-1-yl)amino)-1-isopropyl-cyclopentane-1-carboxamides as CCR2 antagonists. Eur J Med Chem 93:121-34 (2015)  
Target
Name:
C-C chemokine receptor type 2
Synonyms:
C-C chemokine receptor type 2 (CCR2) CCR2_HUMAN Chemoattractant Cytokine Receptor 2 (CCR2) Monocyte chemotactic protein-1 (MCP-1)
Type:
Enzyme
Mol. Mass.:
41932.32
Organism:
Homo sapiens (Human)
Description:
P41597
Residue:
374
  
Inhibitor
Name:
BDBM50077980
Synonyms:
CHEMBL3417117
Type:
Small organic molecule
Emp. Form.:
C28H32ClF3N2O
Mol. Mass.:
505.015
SMILES:
CC(C)[C@@]1(CC[C@H](C1)NC1CCc2cc(Cl)ccc12)C(=O)N1CCc2ccc(cc2C1)C(F)(F)F
: