Target
Apelin receptor
Ligand
BDBM50078011
Substrate
Meas. Tech.
ChEMBL_1471753 (CHEMBL3421345)
Ki
>10000±n/a nM
Citation
 Murza, ABesserer-Offroy, ÉCôté, JBérubé, PLongpré, JMDumaine, RLesur, OAuger-Messier, MLeduc, RSarret, PMarsault, É C-Terminal modifications of apelin-13 significantly change ligand binding, receptor signaling, and hypotensive action. J Med Chem 58:2431-40 (2015)  
Target
Name:
Apelin receptor
Synonyms:
AGTRL1 APJ_HUMAN Angiotensin receptor-like 1 Apelin receptor (APJ) G-protein coupled receptor HG11
Type:
Enzyme Catalytic Domain
Mol. Mass.:
42664.06
Organism:
Homo sapiens (Human)
Description:
P35414
Residue:
380
  
Inhibitor
Name:
BDBM50078011
Synonyms:
CHEMBL3417394
Type:
Small organic molecule
Emp. Form.:
C32H42N4O6
Mol. Mass.:
578.6991
SMILES:
CCCC[C@H](NC(=O)[C@@H]1CCCN1)C(=O)N1CCC[C@H]1C(=O)N[C@@H](Cc1ccc(OCc2ccccc2)cc1)C(O)=O
: