Target
Induced myeloid leukemia cell differentiation protein Mcl-1
Ligand
BDBM50078151
Substrate
Meas. Tech.
ChEMBL_1472592 (CHEMBL3417957)
Ki
35±n/a nM
Citation
 Bruncko, MWang, LSheppard, GSPhillips, DCTahir, SKXue, JErickson, SFidanze, SFry, EHasvold, LJenkins, GJJin, SJudge, RAKovar, PJMadar, DNimmer, PPark, CPetros, AMRosenberg, SHSmith, MLSong, XSun, CTao, ZFWang, XXiao, YZhang, HTse, CLeverson, JDElmore, SWSouers, AJ Structure-guided design of a series of MCL-1 inhibitors with high affinity and selectivity. J Med Chem 58:2180-94 (2015)  
Target
Name:
Induced myeloid leukemia cell differentiation protein Mcl-1
Synonyms:
BCL2L3 Bcl-2-like protein 3 (Mcl-1) Bcl2-L-3 MCL1 Mcl-1 Myeloid cell leukemia sequence 1 (BCL2-related) | mcl1/EAT
Type:
Membrane; Single-pass membrane protein
Mol. Mass.:
37332.87
Organism:
Homo sapiens (Human)
Description:
Q07820
Residue:
350
  
Inhibitor
Name:
BDBM50078151
Synonyms:
CHEMBL3417691
Type:
Small organic molecule
Emp. Form.:
C29H25NO3
Mol. Mass.:
435.5137
SMILES:
Cc1ccccc1-c1cccc2c(CCCOc3cccc4ccccc34)c([nH]c12)C(O)=O
: