Target
Induced myeloid leukemia cell differentiation protein Mcl-1
Ligand
BDBM50078160
Substrate
Meas. Tech.
ChEMBL_1472595 (CHEMBL3417960)
Ki
0.430000±n/a nM
Citation
 Bruncko, MWang, LSheppard, GSPhillips, DCTahir, SKXue, JErickson, SFidanze, SFry, EHasvold, LJenkins, GJJin, SJudge, RAKovar, PJMadar, DNimmer, PPark, CPetros, AMRosenberg, SHSmith, MLSong, XSun, CTao, ZFWang, XXiao, YZhang, HTse, CLeverson, JDElmore, SWSouers, AJ Structure-guided design of a series of MCL-1 inhibitors with high affinity and selectivity. J Med Chem 58:2180-94 (2015)  
Target
Name:
Induced myeloid leukemia cell differentiation protein Mcl-1
Synonyms:
BCL2L3 Bcl-2-like protein 3 (Mcl-1) Bcl2-L-3 MCL1 Mcl-1 Myeloid cell leukemia sequence 1 (BCL2-related) | mcl1/EAT
Type:
Membrane; Single-pass membrane protein
Mol. Mass.:
37332.87
Organism:
Homo sapiens (Human)
Description:
Q07820
Residue:
350
  
Inhibitor
Name:
BDBM50078160
Synonyms:
CHEMBL3417701
Type:
Small organic molecule
Emp. Form.:
C45H52N6O7S
Mol. Mass.:
820.995
SMILES:
Cc1nn(C)c(COc2ccc(cc2)N2CCN(CC2)S(C)(=O)=O)c1-c1cccc2c(CCCOc3cccc4ccccc34)c(C(O)=O)n(CCN3CCOCC3)c12
: