Target
Bcl-2-like protein 2
Ligand
BDBM50078160
Substrate
Meas. Tech.
ChEMBL_1472599 (CHEMBL3417964)
Ki
>660±n/a nM
Citation
 Bruncko, MWang, LSheppard, GSPhillips, DCTahir, SKXue, JErickson, SFidanze, SFry, EHasvold, LJenkins, GJJin, SJudge, RAKovar, PJMadar, DNimmer, PPark, CPetros, AMRosenberg, SHSmith, MLSong, XSun, CTao, ZFWang, XXiao, YZhang, HTse, CLeverson, JDElmore, SWSouers, AJ Structure-guided design of a series of MCL-1 inhibitors with high affinity and selectivity. J Med Chem 58:2180-94 (2015)  
Target
Name:
Bcl-2-like protein 2
Synonyms:
Apoptosis regulator Bcl-W BCL-W BCLW Bcl2-L-2 | KIAA0271
Type:
Protein
Mol. Mass.:
20742.61
Organism:
Homo sapiens (Human)
Description:
Residue:
193
  
Inhibitor
Name:
BDBM50078160
Synonyms:
CHEMBL3417701
Type:
Small organic molecule
Emp. Form.:
C45H52N6O7S
Mol. Mass.:
820.995
SMILES:
Cc1nn(C)c(COc2ccc(cc2)N2CCN(CC2)S(C)(=O)=O)c1-c1cccc2c(CCCOc3cccc4ccccc34)c(C(O)=O)n(CCN3CCOCC3)c12
: