Target
Adenosine receptor A1
Ligand
BDBM50078429
Substrate
Meas. Tech.
ChEMBL_1471048 (CHEMBL3420493)
EC50
10±n/a nM
Citation
 Petrelli, RTorquati, IKachler, SLuongo, LMaione, SFranchetti, PGrifantini, MNovellino, ELavecchia, AKlotz, KNCappellacci, L 5'-C-Ethyl-tetrazolyl-N(6)-substituted adenosine and 2-chloro-adenosine derivatives as highly potent dual acting A1 adenosine receptor agonists and A3 adenosine receptor antagonists. J Med Chem 58:2560-6 (2015)  
Target
Name:
Adenosine receptor A1
Synonyms:
A1 adenosine receptor (hA1) AA1R_HUMAN ADORA1 Adenosine A1-receptor Adenosine receptor A1 (hA1) | Adenosine transporter (AdT)
Type:
G Protein-Coupled Receptor (GPCR)
Mol. Mass.:
36520.92
Organism:
Homo sapiens (Human)
Description:
P30542
Residue:
326
  
Inhibitor
Name:
BDBM50078429
Synonyms:
CHEMBL3414943
Type:
Small organic molecule
Emp. Form.:
C19H24ClN9O3
Mol. Mass.:
461.905
SMILES:
[H][C@@]12CC[C@]([H])(C1)[C@H](C2)Nc1nc(Cl)nc2n(cnc12)[C@@H]1O[C@@H]([C@@H](O)[C@H]1O)c1nnn(CC)n1
: