Target
Reverse transcriptase
Ligand
BDBM1434
Substrate
Meas. Tech.
ChEMBL_1471243 (CHEMBL3418336)
IC50
2400±n/a nM
Citation
 Huang, BLiang, XLi, CChen, WLiu, TLi, XSun, YFu, LLiu, HDe Clercq, EPannecouque, CZhan, PLiu, X Fused heterocycles bearing bridgehead nitrogen as potent HIV-1 NNRTIs. Part 4: design, synthesis and biological evaluation of novel imidazo[1,2-a]pyrazines. Eur J Med Chem 93:330-7 (2015)  
Target
Name:
Reverse transcriptase
Synonyms:
Type:
Protein
Mol. Mass.:
29598.37
Organism:
Human immunodeficiency virus 1
Description:
Q9WKE8
Residue:
254
  
Inhibitor
Name:
BDBM1434
Synonyms:
11-cyclopropyl-5,11-dihydro-4-methyl-6H-dipyrido[3,2-b:2 ,3 -e][1,4]diazepin-6-one BI-RG-587 Nevirapine US11420959, Example NVP | Viramune
Type:
Small organic molecule
Emp. Form.:
C15H14N4O
Mol. Mass.:
266.2979
SMILES:
Cc1ccnc2N(C3CC3)c3ncccc3C(=O)Nc12
: