Target
Cannabinoid receptor 1
Ligand
BDBM50078765
Substrate
Meas. Tech.
ChEMBL_1472331 (CHEMBL3419681)
EC50
12±n/a nM
Citation
 Ogawa, GTius, MAZhou, HNikas, SPHalikhedkar, AMallipeddi, SMakriyannis, A 3'-functionalized adamantyl cannabinoid receptor probes. J Med Chem 58:3104-16 (2015)  
Target
Name:
Cannabinoid receptor 1
Synonyms:
Brain-type cannabinoid receptor CB-R CNR1_RAT Cannabinoid receptor Cnr1 | Skr6
Type:
G Protein-Coupled Receptor (GPCR)
Mol. Mass.:
52856.55
Organism:
Rattus norvegicus (rat)
Description:
P20272
Residue:
473
  
Inhibitor
Name:
BDBM50078765
Synonyms:
CHEMBL3416124
Type:
Small organic molecule
Emp. Form.:
C26H33NO3S
Mol. Mass.:
439.61
SMILES:
[H][C@@]12C[C@H](O)CC[C@@]1([H])C(C)(C)Oc1cc(cc(O)c21)[C@@]12CC3CC(C[C@](C3)(C1)N=C=S)C2
: