Target
Cannabinoid receptor 1
Ligand
BDBM50078767
Substrate
Meas. Tech.
ChEMBL_1472331 (CHEMBL3419681)
EC50
5.4±n/a nM
Citation
 Ogawa, GTius, MAZhou, HNikas, SPHalikhedkar, AMallipeddi, SMakriyannis, A 3'-functionalized adamantyl cannabinoid receptor probes. J Med Chem 58:3104-16 (2015)  
Target
Name:
Cannabinoid receptor 1
Synonyms:
Brain-type cannabinoid receptor CB-R CNR1_RAT Cannabinoid receptor Cnr1 | Skr6
Type:
G Protein-Coupled Receptor (GPCR)
Mol. Mass.:
52856.55
Organism:
Rattus norvegicus (rat)
Description:
P20272
Residue:
473
  
Inhibitor
Name:
BDBM50078767
Synonyms:
CHEMBL3416126
Type:
Small organic molecule
Emp. Form.:
C27H35NO3
Mol. Mass.:
421.5717
SMILES:
[H][C@@]12C[C@H](O)CC[C@@]1([H])C(C)(C)Oc1cc(cc(O)c21)[C@]12CC3CC(C[C@@](CC#N)(C3)C1)C2
: