Target
Cannabinoid receptor 2
Ligand
BDBM50078763
Substrate
Meas. Tech.
ChEMBL_1472324 (CHEMBL3419674)
Ki
2.8±n/a nM
Citation
 Ogawa, GTius, MAZhou, HNikas, SPHalikhedkar, AMallipeddi, SMakriyannis, A 3'-functionalized adamantyl cannabinoid receptor probes. J Med Chem 58:3104-16 (2015)  
Target
Name:
Cannabinoid receptor 2
Synonyms:
CANNABINOID CB2 CB2 Cannabinoid CB2 receptor Cannabinoid receptor 2 mCB2
Type:
Enzyme Catalytic Domain
Mol. Mass.:
38220.43
Organism:
MOUSE
Description:
P47936
Residue:
347
  
Inhibitor
Name:
BDBM50078763
Synonyms:
CHEMBL3416122
Type:
Small organic molecule
Emp. Form.:
C26H33NO3
Mol. Mass.:
407.5451
SMILES:
[H][C@@]12C[C@H](O)CC[C@@]1([H])C(C)(C)Oc1cc(cc(O)c21)[C@@]12CC3CC(C[C@](C3)(C1)C#N)C2
: