Target
Angiopoietin-1 receptor
Ligand
BDBM50073587
Substrate
Meas. Tech.
ChEMBL_1470622 (CHEMBL3420209)
EC50
117±n/a nM
Citation
 Yu, BYu, ZQi, PPYu, DQLiu, HM Discovery of orally active anticancer candidate CFI-400945 derived from biologically promising spirooxindoles: success and challenges. Eur J Med Chem 95:35-40 (2015)  
Target
Name:
Angiopoietin-1 receptor
Synonyms:
TEK TIE2_HUMAN Tyrosine-protein kinase receptor (TIE-2) Tyrosine-protein kinase receptor TEK (p140 TEK) Tyrosine-protein kinase receptor TIE2/TEK VMCM1 p140 TEK
Type:
Enzyme
Mol. Mass.:
125835.70
Organism:
Homo sapiens (Human)
Description:
Q02763
Residue:
1124
  
Inhibitor
Name:
BDBM50073587
Synonyms:
CHEMBL3408947 US20230365537, Example CFI-400495 | US9907800, Example A185
Type:
Small organic molecule
Emp. Form.:
C33H34N4O3
Mol. Mass.:
534.6481
SMILES:
COc1ccc2NC(=O)[C@@]3(C[C@H]3c3ccc4c(\C=C\c5ccc(CN6C[C@H](C)O[C@H](C)C6)cc5)n[nH]c4c3)c2c1
: