Target
MAP kinase-interacting serine/threonine-protein kinase 1
Ligand
BDBM50298223
Substrate
Meas. Tech.
ChEMBL_1470960 (CHEMBL3419828)
Ki
1010±n/a nM
Citation
 Yu, MLi, PBasnet, SKKumarasiri, MDiab, STeo, TAlbrecht, HWang, S Discovery of 4-(dihydropyridinon-3-yl)amino-5-methylthieno[2,3-d]pyrimidine derivatives as potent Mnk inhibitors: synthesis, structure-activity relationship analysis and biological evaluation. Eur J Med Chem 95:116-26 (2015)  
Target
Name:
MAP kinase-interacting serine/threonine-protein kinase 1
Synonyms:
MAP Kinase-Interacting Protein Kinase (MNK1) MAP kinase-interacting serine/threonine-protein kinase 1 (MnK1) MAP-kinase interacting kinase 1 (MNK1) MKNK1 MNK1
Type:
Serine/threonine-protein kinase
Mol. Mass.:
51342.85
Organism:
Homo sapiens (Human)
Description:
Q9BUB5
Residue:
465
  
Inhibitor
Name:
BDBM50298223
Synonyms:
CGP-57380 CHEMBL576817 | N-(4-fluorophenyl)-3H-pyrazolo[3,4-d]pyrimidine-3,4-diamine
Type:
Small organic molecule
Emp. Form.:
C11H9FN6
Mol. Mass.:
244.2278
SMILES:
Nc1ncnc2n[nH]c(Nc3ccc(F)cc3)c12
: