Target
Protein mono-ADP-ribosyltransferase PARP15
Ligand
BDBM50079622
Substrate
Meas. Tech.
ChEMBL_1472394 (CHEMBL3420115)
IC50
16982±n/a nM
Citation
 Ekblad, TLindgren, AEAndersson, CDCaraballo, RThorsell, AGKarlberg, TSpjut, SLinusson, ASchüler, HElofsson, M Towards small molecule inhibitors of mono-ADP-ribosyltransferases. Eur J Med Chem 95:546-51 (2015)  
Target
Name:
Protein mono-ADP-ribosyltransferase PARP15
Synonyms:
(ARTD7 or PARP15) 2.4.2.- ADP-ribosyltransferase diphtheria toxin-like 7 B-aggressive lymphoma protein 3 Human diphtheria toxin-like ADP-ribosyltransferase (ARTD7 or PARP15, Y598L) PARP-15 Poly [ADP-ribose] polymerase 15 | Synonyms=BAL3
Type:
Mol. Mass.:
74595.89
Organism:
Homo sapiens (Human)
Description:
Q460N3
Residue:
678
  
Inhibitor
Name:
BDBM50079622
Synonyms:
CHEMBL3414773
Type:
Small organic molecule
Emp. Form.:
C15H17N3O3
Mol. Mass.:
287.3138
SMILES:
NC(=O)c1cccc(NC(=O)\C=C/C(=O)N2CCCC2)c1
: