Target
Protein mono-ADP-ribosyltransferase PARP10
Ligand
BDBM50079624
Substrate
Meas. Tech.
ChEMBL_1472392 (CHEMBL3420113)
IC50
1995±n/a nM
Citation
 Ekblad, TLindgren, AEAndersson, CDCaraballo, RThorsell, AGKarlberg, TSpjut, SLinusson, ASchüler, HElofsson, M Towards small molecule inhibitors of mono-ADP-ribosyltransferases. Eur J Med Chem 95:546-51 (2015)  
Target
Name:
Protein mono-ADP-ribosyltransferase PARP10
Synonyms:
2.4.2.- ADP-ribosyltransferase diphtheria toxin-like 10 Human diphtheria toxin-like ADP-ribosyltransferase (ARTD10 or PARP10, L926Y)) Human diphtheria toxin-like ADP-ribosyltransferase (ARTD10 or PARP10, S927A)) PARP-10 Poly [ADP-ribose] polymerase 10
Type:
Mol. Mass.:
109953.63
Organism:
Homo sapiens (Human)
Description:
Q53GL7
Residue:
1025
  
Inhibitor
Name:
BDBM50079624
Synonyms:
CHEMBL3414771
Type:
Small organic molecule
Emp. Form.:
C12H13N3O3
Mol. Mass.:
247.2499
SMILES:
CNC(=O)\C=C/C(=O)Nc1cccc(c1)C(N)=O
: