Target
Amine oxidase [flavin-containing] B
Ligand
BDBM50080870
Substrate
Meas. Tech.
ChEMBL_1475316 (CHEMBL3425213)
IC50
32020±n/a nM
Citation
 Valente, SRodriguez, VMercurio, CVianello, PSaponara, BCirilli, RCiossani, GLabella, DMarrocco, BRuoppolo, GBotrugno, OADessanti, PMinucci, SMattevi, AVarasi, MMai, A Pure Diastereomers of a Tranylcypromine-Based LSD1 Inhibitor: Enzyme Selectivity and In-Cell Studies. ACS Med Chem Lett 6:173-7 (2015)  
Target
Name:
Amine oxidase [flavin-containing] B
Synonyms:
AOFB_HUMAN MAOB Monoamine oxidase type B (MAO B) Monoamine oxidase type B (MAOB)
Type:
Protein
Mol. Mass.:
58768.76
Organism:
Homo sapiens (Human)
Description:
P27338
Residue:
520
  
Inhibitor
Name:
BDBM50080870
Synonyms:
CHEMBL3421673
Type:
Small organic molecule
Emp. Form.:
C26H28ClN3O3
Mol. Mass.:
465.972
SMILES:
Cl.N[C@@H]1C[C@H]1c1ccc(NC(=O)[C@H](Cc2ccccc2)NC(=O)OCc2ccccc2)cc1
: