Target
Amine oxidase [flavin-containing] A
Ligand
BDBM50080873
Substrate
Meas. Tech.
ChEMBL_1475315 (CHEMBL3425212)
IC50
200±n/a nM
Citation
 Valente, SRodriguez, VMercurio, CVianello, PSaponara, BCirilli, RCiossani, GLabella, DMarrocco, BRuoppolo, GBotrugno, OADessanti, PMinucci, SMattevi, AVarasi, MMai, A Pure Diastereomers of a Tranylcypromine-Based LSD1 Inhibitor: Enzyme Selectivity and In-Cell Studies. ACS Med Chem Lett 6:173-7 (2015)  
Target
Name:
Amine oxidase [flavin-containing] A
Synonyms:
AOFA_HUMAN MAO-A Monoamine oxidase Monoamine oxidase type A (MAO A) Monoamine oxidase type A (MAOA)
Type:
Protein
Mol. Mass.:
59689.53
Organism:
Homo sapiens (Human)
Description:
P21397
Residue:
527
  
Inhibitor
Name:
BDBM50080873
Synonyms:
CHEMBL3421674
Type:
Small organic molecule
Emp. Form.:
C26H28ClN3O3
Mol. Mass.:
465.972
SMILES:
Cl.N[C@H]1C[C@@H]1c1ccc(NC(=O)[C@@H](Cc2ccccc2)NC(=O)OCc2ccccc2)cc1
: