Target
Melanocyte-stimulating hormone receptor
Ligand
BDBM50080878
Substrate
Meas. Tech.
ChEMBL_1475327 (CHEMBL3425224)
EC50
750±n/a nM
Citation
 Van der Poorten, OFehér, KBuysse, KFeytens, DZoi, ISchwartz, SDMartins, JCTourwé, DCai, MHruby, VJBallet, S Azepinone-Containing Tetrapeptide Analogues of Melanotropin Lead to Selective hMC4R Agonists and hMC5R Antagonist. ACS Med Chem Lett 6:192-7 (2015)  
Target
Name:
Melanocyte-stimulating hormone receptor
Synonyms:
MC1-R MSH-R MSHR_HUMAN Melanocortin receptor (M1 and M4) Melanocortin receptor 1 (MC1-R) | Melanocortin receptor 1 (MC1R)
Type:
Enzyme
Mol. Mass.:
34717.23
Organism:
Homo sapiens (Human)
Description:
Q01726
Residue:
317
  
Inhibitor
Name:
BDBM50080878
Synonyms:
CHEMBL3421680
Type:
Small organic molecule
Emp. Form.:
C34H42N12O5
Mol. Mass.:
698.7747
SMILES:
CC(=O)N[C@H]1Cn2nncc2CN([C@H](Cc2ccccc2)C(=O)N[C@@H](CCCNC(N)=N)C(=O)N[C@@H](Cc2c[nH]c3ccccc23)C(N)=O)C1=O
: