Target
Melanocortin receptor 4
Ligand
BDBM50080874
Substrate
Meas. Tech.
ChEMBL_1475333 (CHEMBL3425230)
IC50
447±n/a nM
Citation
 Van der Poorten, OFehér, KBuysse, KFeytens, DZoi, ISchwartz, SDMartins, JCTourwé, DCai, MHruby, VJBallet, S Azepinone-Containing Tetrapeptide Analogues of Melanotropin Lead to Selective hMC4R Agonists and hMC5R Antagonist. ACS Med Chem Lett 6:192-7 (2015)  
Target
Name:
Melanocortin receptor 4
Synonyms:
MC4-R MC4R_HUMAN Melanocortin receptor 4 (MC-4) Melanocortin receptor 4 (MC4R)
Type:
Enzyme
Mol. Mass.:
36949.50
Organism:
Homo sapiens (Human)
Description:
P32245
Residue:
332
  
Inhibitor
Name:
BDBM50080874
Synonyms:
CHEMBL3421676
Type:
Small organic molecule
Emp. Form.:
C40H46N10O5
Mol. Mass.:
746.8572
SMILES:
CC(=O)N[C@H]1Cc2c(CN([C@H](Cc3ccccc3)C(=O)N[C@@H](CCCNC(N)=N)C(=O)N[C@@H](Cc3c[nH]c4ccccc34)C(N)=O)C1=O)[nH]c1ccccc21
: