Target
Cytochrome P450 2C19
Ligand
BDBM50081394
Substrate
Meas. Tech.
ChEMBL_1475771 (CHEMBL3425004)
IC50
18000±n/a nM
Citation
 Hoveyda, HRFraser, GLRoy, MODutheuil, GBatt, FEl Bousmaqui, MKorac, JLenoir, FLapin, ANoël, SBlanc, S Discovery and optimization of novel antagonists to the human neurokinin-3 receptor for the treatment of sex-hormone disorders (Part I). J Med Chem 58:3060-82 (2015)  
Target
Name:
Cytochrome P450 2C19
Synonyms:
CP2CJ_HUMAN CYPIIC17 Cytochrome P450 2C19 (CYP2C19) Mephenytoin 4-hydroxylase P450-254C
Type:
Enzyme
Mol. Mass.:
55935.47
Organism:
Homo sapiens (Human)
Description:
P33261
Residue:
490
  
Inhibitor
Name:
BDBM50081394
Synonyms:
CHEMBL3422013
Type:
Small organic molecule
Emp. Form.:
C21H16F3N5OS2
Mol. Mass.:
475.51
SMILES:
C[C@H]1N(CCn2c1nnc2-c1csc(n1)C(F)(F)F)C(=O)c1ccc(cc1)-c1cccs1
: