Target
Cytochrome P450 1A2
Ligand
BDBM50435005
Substrate
Meas. Tech.
ChEMBL_1474031 (CHEMBL3423889)
Ki
76±n/a nM
Citation
 Lv, WLiu, JSkaar, TCFlockhart, DACushman, M Design and synthesis of norendoxifen analogues with dual aromatase inhibitory and estrogen receptor modulatory activities. J Med Chem 58:2623-48 (2015)  
Target
Name:
Cytochrome P450 1A2
Synonyms:
CP1A2_HUMAN CYPIA2 Cytochrome P(3)450 Cytochrome P450 1A2 (CYP1A2) Cytochrome P450-P3
Type:
Enzyme
Mol. Mass.:
58423.38
Organism:
Homo sapiens (Human)
Description:
P05177
Residue:
516
  
Inhibitor
Name:
BDBM50435005
Synonyms:
CHEMBL2386285
Type:
Small organic molecule
Emp. Form.:
C24H25NO2
Mol. Mass.:
359.4608
SMILES:
CC\C(=C(\c1ccc(O)cc1)c1ccc(OCCN)cc1)c1ccccc1
: