Target
Pancreatic triacylglycerol lipase
Ligand
BDBM50241243
Substrate
Meas. Tech.
ChEMBL_1474109 (CHEMBL3424042)
IC50
>70000±n/a nM
Citation
 Jeong, JYJo, YHKim, SBLiu, QLee, JWMo, EJLee, KYHwang, BYLee, MK Pancreatic lipase inhibitory constituents from Morus alba leaves and optimization for extraction conditions. Bioorg Med Chem Lett 25:2269-74 (2015)  
Target
Name:
Pancreatic triacylglycerol lipase
Synonyms:
LIPP_PIG PNLIP Pancreatic lipase | Pancreatic triacylglycerol lipase
Type:
Enzyme
Mol. Mass.:
50080.69
Organism:
Sus scrofa (Pig)
Description:
P00591
Residue:
450
  
Inhibitor
Name:
BDBM50241243
Synonyms:
3,4',5,7-Tetrahydroxyflavone-3-glucoside 4H-1-Benzopyran-4-one, 3-(beta-D-glucopyranosyloxy)-5,7-dihydroxy-2-(4-hydroxyphenyl)- Astragalin cid_5282102 | kaempferol 3-O-glucoside
Type:
Small organic molecule
Emp. Form.:
C21H20O11
Mol. Mass.:
448.3769
SMILES:
OC[C@H]1O[C@@H](Oc2c(O)c3c(cc(O)cc3=O)oc2-c2ccc(O)cc2)[C@H](O)[C@@H](O)[C@@H]1O
: