Target
Metabotropic glutamate receptor 5
Ligand
BDBM50083317
Substrate
Meas. Tech.
ChEMBL_1474204 (CHEMBL3424262)
IC50
21000±n/a nM
Citation
 Lakkaraju, SKMbatia, HHanscom, MZhao, ZWu, JStoica, BMacKerell, ADFaden, AIXue, F Cyclopropyl-containing positive allosteric modulators of metabotropic glutamate receptor subtype 5. Bioorg Med Chem Lett 25:2275-9 (2015)  
Target
Name:
Metabotropic glutamate receptor 5
Synonyms:
GRM5_MOUSE Grm5 | Mglur5
Type:
PROTEIN
Mol. Mass.:
131881.16
Organism:
Mus musculus
Description:
ChEMBL_103834
Residue:
1203
  
Inhibitor
Name:
BDBM50083317
Synonyms:
CHEMBL3423096
Type:
Small organic molecule
Emp. Form.:
C17H14FN3O
Mol. Mass.:
295.311
SMILES:
Fc1cccc(c1)[C@H]1C[C@@H]1C(=O)Nc1nc2ccccc2[nH]1
: