Target
Adenosine receptor A2a
Ligand
BDBM50083544
Substrate
Meas. Tech.
ChEMBL_1474462 (CHEMBL3423751)
Kd
11000±n/a nM
Citation
 Molero, AVendrell, MBonaventura, JZachmann, JLópez, LPardo, LLluis, CCortés, AAlbericio, FCasadó, VRoyo, M A solid-phase combinatorial approach for indoloquinolizidine-peptides with high affinity at D(1) and D(2) dopamine receptors. Eur J Med Chem 97:173-80 (2015)  
Target
Name:
Adenosine receptor A2a
Synonyms:
A2A adenosine receptor (hA2A) ADENOSINE A2 ADORA2 Adenosine A2A receptor (A2AAR)
Type:
G Protein-Coupled Receptor (GPCR)
Mol. Mass.:
44716.46
Organism:
Homo sapiens (Human)
Description:
P29274
Residue:
412
  
Inhibitor
Name:
BDBM50083544
Synonyms:
CHEMBL3423409
Type:
Small organic molecule
Emp. Form.:
C43H61FN8O5
Mol. Mass.:
788.9934
SMILES:
[H][C@]12CC[C@@H](CN1CCc1c2[nH]c2ccccc12)C(=O)NCCCCCC(=O)N[C@@H](CCCC)C(=O)N[C@@H](Cc1ccc(F)cc1)C(=O)N[C@@H](CCCCN)C(N)=O
: