Target
Coagulation factor XIII A chain
Ligand
BDBM50083728
Substrate
Meas. Tech.
ChEMBL_1475035 (CHEMBL3424606)
IC50
55±n/a nM
Citation
 Avery, CAPease, RJSmith, KBoothby, MBuckley, HMGrant, PJFishwick, CW (±) cis-Bisamido epoxides: A novel series of potent FXIII-A inhibitors. Eur J Med Chem 98:49-53 (2015)  
Target
Name:
Coagulation factor XIII A chain
Synonyms:
Coagulation factor XIII F13A1 | F13A_HUMAN
Type:
PROTEIN
Mol. Mass.:
83261.29
Organism:
Homo sapiens (Human)
Description:
ChEMBL_1475048
Residue:
732
  
Inhibitor
Name:
BDBM50083728
Synonyms:
CHEMBL3423193
Type:
Small organic molecule
Emp. Form.:
C16H14N2O4
Mol. Mass.:
298.2934
SMILES:
NC(=O)[C@H]1O[C@H]1C(=O)Nc1ccc(Oc2ccccc2)cc1
: