Target
Hematopoietic prostaglandin D synthase
Ligand
BDBM50084157
Substrate
Meas. Tech.
ChEMBL_1477164 (CHEMBL3428604)
IC50
35±n/a nM
Citation
 Edfeldt, FEvenäs, JLepistö, MWard, APetersen, JWissler, LRohman, MSivars, USvensson, KPerry, MFeierberg, IZhou, XHHansson, TNarjes, F Identification of indole inhibitors of human hematopoietic prostaglandin D2 synthase (hH-PGDS). Bioorg Med Chem Lett 25:2496-500 (2015)  
Target
Name:
Hematopoietic prostaglandin D synthase
Synonyms:
GSTS Glutathione-requiring prostaglandin D synthase HPGDS Hematopoietic prostaglandin D synthase Hematopoietic prostaglandin D synthase (HPGDS) PTGDS2 Prostaglandin D Synthase
Type:
Enzyme
Mol. Mass.:
23341.07
Organism:
Homo sapiens (Human)
Description:
The protein was expressed in E. coli strain BL21(DE3) with an N-terminal 6-His tag.
Residue:
199
  
Inhibitor
Name:
BDBM50084157
Synonyms:
CHEMBL3425955
Type:
Small organic molecule
Emp. Form.:
C18H16N4O2
Mol. Mass.:
320.3452
SMILES:
O=C(Nc1cncc(c1)-c1cccc2[nH]ccc12)[C@@H]1CCC(=O)N1
: