Target
Aldo-keto reductase family 1 member B1 [K65Q]
Ligand
BDBM50084412
Substrate
Meas. Tech.
ChEMBL_1477654 (CHEMBL3428033)
IC50
27300±n/a nM
Citation
 Iqbal, ZHameed, SAli, STehseen, YShahid, MIqbal, J Synthesis, characterization, hypoglycemic and aldose reductase inhibition activity of arylsulfonylspiro[fluorene-9,5'-imidazolidine]-2',4'-diones. Eur J Med Chem 98:127-38 (2015)  
Target
Name:
Aldo-keto reductase family 1 member B1 [K65Q]
Synonyms:
AKR1B1 Aldose reductase
Type:
Protein
Mol. Mass.:
35916.27
Organism:
Bos taurus (Cattle)
Description:
P16116[K65Q]
Residue:
315
  
Inhibitor
Name:
BDBM50084412
Synonyms:
CHEMBL3426249
Type:
Small organic molecule
Emp. Form.:
C25H16N2O4S
Mol. Mass.:
440.471
SMILES:
O=C1NC(=O)C2(N1S(=O)(=O)c1ccc3ccccc3c1)c1ccccc1-c1ccccc21
: