Target
Activated CDC42 kinase 1
Ligand
BDBM50084462
Substrate
Meas. Tech.
ChEMBL_1477698 (CHEMBL3428296)
IC50
34±n/a nM
Citation
 Lawrence, HRMahajan, KLuo, YZhang, DTindall, NHuseyin, MGevariya, HKazi, SOzcan, SMahajan, NPLawrence, NJ Development of novel ACK1/TNK2 inhibitors using a fragment-based approach. J Med Chem 58:2746-63 (2015)  
Target
Name:
Activated CDC42 kinase 1
Synonyms:
ACK1 Activated CDC42 kinase 1 (ACK-1) Tyrosine kinase non-receptor protein 2
Type:
Protein
Mol. Mass.:
114577.86
Organism:
Homo sapiens (Human)
Description:
Q07912
Residue:
1038
  
Inhibitor
Name:
BDBM50084462
Synonyms:
CHEMBL3426879
Type:
Small organic molecule
Emp. Form.:
C28H30ClFN6O4
Mol. Mass.:
569.027
SMILES:
OC(=O)C1CCN(CC1)c1ccc(Nc2ncc(C(=O)Nc3c(F)cccc3Cl)c(NCC3CCCO3)n2)cc1
: