Target
Activated CDC42 kinase 1
Ligand
BDBM50421256
Substrate
Meas. Tech.
ChEMBL_1477876 (CHEMBL3429155)
Ki
0.300000±n/a nM
Citation
 Lawrence, HRMahajan, KLuo, YZhang, DTindall, NHuseyin, MGevariya, HKazi, SOzcan, SMahajan, NPLawrence, NJ Development of novel ACK1/TNK2 inhibitors using a fragment-based approach. J Med Chem 58:2746-63 (2015)  
Target
Name:
Activated CDC42 kinase 1
Synonyms:
ACK1 Activated CDC42 kinase 1 (ACK-1) Tyrosine kinase non-receptor protein 2
Type:
Protein
Mol. Mass.:
114577.86
Organism:
Homo sapiens (Human)
Description:
Q07912
Residue:
1038
  
Inhibitor
Name:
BDBM50421256
Synonyms:
CHEMBL2087874
Type:
Small organic molecule
Emp. Form.:
C26H28N4O2S2
Mol. Mass.:
492.656
SMILES:
CN(C)CCOc1ccc(cc1)-c1oc2ncnc(NCC3SCCS3)c2c1-c1ccccc1
: