Target
Activated CDC42 kinase 1
Ligand
BDBM50246164
Substrate
Meas. Tech.
ChEMBL_1477876 (CHEMBL3429155)
IC50
2.0±n/a nM
Citation
 Lawrence, HRMahajan, KLuo, YZhang, DTindall, NHuseyin, MGevariya, HKazi, SOzcan, SMahajan, NPLawrence, NJ Development of novel ACK1/TNK2 inhibitors using a fragment-based approach. J Med Chem 58:2746-63 (2015)  
Target
Name:
Activated CDC42 kinase 1
Synonyms:
ACK1 Activated CDC42 kinase 1 (ACK-1) Tyrosine kinase non-receptor protein 2
Type:
Protein
Mol. Mass.:
114577.86
Organism:
Homo sapiens (Human)
Description:
Q07912
Residue:
1038
  
Inhibitor
Name:
BDBM50246164
Synonyms:
CHEMBL487242 | N3-(2,6-dimethylphenyl)-1-(3-methoxy-3-methylbutyl)-N6-phenyl-1H-pyrazolo[3,4-d]pyrimidine-3,6-diamine
Type:
Small organic molecule
Emp. Form.:
C25H30N6O
Mol. Mass.:
430.5453
SMILES:
COC(C)(C)CCn1nc(Nc2c(C)cccc2C)c2cnc(Nc3ccccc3)nc12
: