Target
Patatin-like phospholipase domain-containing protein 2
Ligand
BDBM50084765
Substrate
Meas. Tech.
ChEMBL_1476694 (CHEMBL3428915)
IC50
>200000±n/a nM
Citation
 Mayer, NSchweiger, MMelcher, MCFledelius, CZechner, RZimmermann, RBreinbauer, R Structure-activity studies in the development of a hydrazone based inhibitor of adipose-triglyceride lipase (ATGL). Bioorg Med Chem 23:2904-16 (2015)  
Target
Name:
Patatin-like phospholipase domain-containing protein 2
Synonyms:
Adipose triglyceride lipase Desnutrin Patatin-like phospholipase domain-containing protein 2 | Pnpla2
Type:
PROTEIN
Mol. Mass.:
53655.79
Organism:
Mus musculus
Description:
ChEMBL_109612
Residue:
486
  
Inhibitor
Name:
BDBM50084765
Synonyms:
CHEMBL3427327
Type:
Small organic molecule
Emp. Form.:
C23H23N3O
Mol. Mass.:
357.4482
SMILES:
C1CN(CCN1\N=C\c1cccc(Oc2ccccc2)c1)c1ccccc1
: