Target
Cyclin-G-associated kinase
Ligand
BDBM50086258
Substrate
Meas. Tech.
ChEMBL_1478106 (CHEMBL3430283)
Kd
300±n/a nM
Citation
 Kovackova, SChang, LBekerman, ENeveu, GBarouch-Bentov, RChaikuad, AHeroven, C?ála, MDe Jonghe, SKnapp, SEinav, SHerdewijn, P Selective Inhibitors of Cyclin G Associated Kinase (GAK) as Anti-Hepatitis C Agents. J Med Chem 58:3393-410 (2015)  
Target
Name:
Cyclin-G-associated kinase
Synonyms:
GAK Serine/threonine-protein kinase GAK
Type:
PROTEIN
Mol. Mass.:
143171.28
Organism:
Homo sapiens (Human)
Description:
ChEMBL_1478229
Residue:
1311
  
Inhibitor
Name:
BDBM50086258
Synonyms:
CHEMBL3425842
Type:
Small organic molecule
Emp. Form.:
C12H11N3OS2
Mol. Mass.:
277.365
SMILES:
OCCNc1snc2cc(cnc12)-c1ccsc1
: