Target
Tyrosine-protein kinase ITK/TSK
Ligand
BDBM50086681
Substrate
Meas. Tech.
ChEMBL_1477114 (CHEMBL3428281)
IC50
4.0±n/a nM
Citation
 Burch, JDBarrett, KChen, YDeVoss, JEigenbrot, CGoldsmith, RIsmaili, MHLau, KLin, ZOrtwine, DFZarrin, AAMcEwan, PABarker, JJEllebrandt, CKordt, DStein, DBWang, XChen, YHu, BXu, XYuen, PWZhang, YPei, Z Tetrahydroindazoles as Interleukin-2 Inducible T-Cell Kinase Inhibitors. Part II. Second-Generation Analogues with Enhanced Potency, Selectivity, and Pharmacodynamic Modulation in Vivo. J Med Chem 58:3806-16 (2015)  
Target
Name:
Tyrosine-protein kinase ITK/TSK
Synonyms:
EMT ITK_HUMAN LYK Tyrosine-protein kinase ITK Tyrosine-protein kinase Lyk
Type:
Protein
Mol. Mass.:
71839.20
Organism:
Homo sapiens (Human)
Description:
Q08881
Residue:
620
  
Inhibitor
Name:
BDBM50086681
Synonyms:
CHEMBL3426309
Type:
Small organic molecule
Emp. Form.:
C25H27F2N5O3S
Mol. Mass.:
515.575
SMILES:
[H][C@]12Cc3c(C[C@@]1(C)C2(F)F)[nH]nc3C(=O)Nc1cnn(c1)[C@H](c1ccccc1)[C@@]1([H])CCCCS1(=O)=O
: