Target
Sodium channel protein type 7 subunit alpha
Ligand
BDBM50010859
Substrate
Meas. Tech.
ChEMBL_1478680 (CHEMBL3430581)
IC50
3600±n/a nM
Citation
 Mirams, GRCui, YSher, AFink, MCooper, JHeath, BMMcMahon, NCGavaghan, DJNoble, D Simulation of multiple ion channel block provides improved early prediction of compounds' clinical torsadogenic risk. Cardiovasc Res 91:53-61 (2011)  
Target
Name:
Sodium channel protein type 7 subunit alpha
Synonyms:
Putative voltage-gated sodium channel subunit alpha Nax SCN7A Sodium channel protein cardiac and skeletal muscle subunit alpha Sodium channel protein type VII subunit alpha
Type:
PROTEIN
Mol. Mass.:
193514.99
Organism:
Homo sapiens (Human)
Description:
ChEMBL_105639
Residue:
1682
  
Inhibitor
Name:
BDBM50010859
Synonyms:
CHEMBL11 IMIPRAMINE PAMOATE | Imipramin
Type:
Small organic molecule
Emp. Form.:
C19H24N2
Mol. Mass.:
280.4073
SMILES:
CN(C)CCCN1c2ccccc2CCc2ccccc12
: