Target
Voltage-dependent L-type calcium channel subunit alpha-1C
Ligand
BDBM50101963
Substrate
Meas. Tech.
ChEMBL_1479136 (CHEMBL3436112)
IC50
730±n/a nM
Citation
 Wisniowska, BMendyk, AFijorek, KGlinka, APolak, S Predictive model for L-type channel inhibition: multichannel block in QT prolongation risk assessment. J Appl Toxicol 32:858-66 (2012)  
Target
Name:
Voltage-dependent L-type calcium channel subunit alpha-1C
Synonyms:
CAC1C_CAVPO CACH2 CACNA1C CCHL1A1 Voltage-dependent L-type calcium channel subunit alpha-1C | Voltage-gated calcium channel subunit alpha Cav1.2
Type:
PROTEIN
Mol. Mass.:
19518.62
Organism:
Cavia porcellus
Description:
ChEMBL_106600
Residue:
169
  
Inhibitor
Name:
BDBM50101963
Synonyms:
BAY-K-5552 Nisoldipine | Sular
Type:
Small organic molecule
Emp. Form.:
C20H24N2O6
Mol. Mass.:
388.4144
SMILES:
COC(=O)C1=C(C)NC(C)=C(C1c1ccccc1[N+]([O-])=O)C(=O)OCC(C)C
: