Target
Bile salt export pump
Ligand
BDBM74574
Substrate
Meas. Tech.
ChEMBL_1481882 (CHEMBL3540573)
IC50
96800±n/a nM
Citation
 Dawson, SStahl, SPaul, NBarber, JKenna, JG In vitro inhibition of the bile salt export pump correlates with risk of cholestatic drug-induced liver injury in humans. Drug Metab Dispos 40:130-8 (2011)  
Target
Name:
Bile salt export pump
Synonyms:
ABCB11 ATP-binding cassette sub-family B member 11 Bile Salt Export Pump, BSEP Bile salt export pump (BSEP)
Type:
Protein
Mol. Mass.:
146405.49
Organism:
Homo sapiens (Human)
Description:
O95342
Residue:
1321
  
Inhibitor
Name:
BDBM74574
Synonyms:
MLS000038419 SMR000037139 | cid_4891
Type:
Small organic molecule
Emp. Form.:
C19H24N2O2
Mol. Mass.:
312.4061
SMILES:
O=C(C1CCCCC1)N1CC2N(CCc3ccccc23)C(=O)C1
: