Target
Bile salt export pump
Ligand
BDBM57045
Substrate
Meas. Tech.
ChEMBL_1481882 (CHEMBL3540573)
IC50
>1000000±n/a nM
Citation
 Dawson, SStahl, SPaul, NBarber, JKenna, JG In vitro inhibition of the bile salt export pump correlates with risk of cholestatic drug-induced liver injury in humans. Drug Metab Dispos 40:130-8 (2011)  
Target
Name:
Bile salt export pump
Synonyms:
ABCB11 ATP-binding cassette sub-family B member 11 Bile Salt Export Pump, BSEP Bile salt export pump (BSEP)
Type:
Protein
Mol. Mass.:
146405.49
Organism:
Homo sapiens (Human)
Description:
O95342
Residue:
1321
  
Inhibitor
Name:
BDBM57045
Synonyms:
MLS000028500 SMR000058271 | cid_4509
Type:
Small organic molecule
Emp. Form.:
C8H6N4O5
Mol. Mass.:
238.157
SMILES:
[O-][N+](=O)c1ccc(\C=N\N2CC(=O)NC2=O)o1
: