Target
Bile salt export pump
Ligand
BDBM50103512
Substrate
Meas. Tech.
ChEMBL_1481882 (CHEMBL3540573)
IC50
>1000000±n/a nM
Citation
 Dawson, SStahl, SPaul, NBarber, JKenna, JG In vitro inhibition of the bile salt export pump correlates with risk of cholestatic drug-induced liver injury in humans. Drug Metab Dispos 40:130-8 (2011)  
Target
Name:
Bile salt export pump
Synonyms:
ABCB11 ATP-binding cassette sub-family B member 11 Bile Salt Export Pump, BSEP Bile salt export pump (BSEP)
Type:
Protein
Mol. Mass.:
146405.49
Organism:
Homo sapiens (Human)
Description:
O95342
Residue:
1321
  
Inhibitor
Name:
BDBM50103512
Synonyms:
CHEBI:31654 SE-1702
Type:
Small organic molecule
Emp. Form.:
C15H21N3O3S
Mol. Mass.:
323.411
SMILES:
Cc1ccc(cc1)S(=O)(=O)NC(=O)NN1CC2CCCC2C1
: