Target
Bile salt export pump
Ligand
BDBM81469
Substrate
Meas. Tech.
ChEMBL_1481883 (CHEMBL3540574)
IC50
>1000000±n/a nM
Citation
 Dawson, SStahl, SPaul, NBarber, JKenna, JG In vitro inhibition of the bile salt export pump correlates with risk of cholestatic drug-induced liver injury in humans. Drug Metab Dispos 40:130-8 (2011)  
Target
Name:
Bile salt export pump
Synonyms:
ABCBB_RAT Abcb11 Bile salt export pump Sister of P-glycoprotein | Spgp
Type:
PROTEIN
Mol. Mass.:
146267.86
Organism:
Rattus norvegicus
Description:
ChEMBL_1481883
Residue:
1321
  
Inhibitor
Name:
BDBM81469
Synonyms:
CAS_91-80-5 NSC_4098
Type:
Small organic molecule
Emp. Form.:
C14H19N3S
Mol. Mass.:
261.386
SMILES:
CN(C)CCN(Cc1cccs1)c1ccccn1
: