Target
Bile salt export pump
Ligand
BDBM48449
Substrate
Meas. Tech.
ChEMBL_1481883 (CHEMBL3540574)
IC50
>1000000±n/a nM
Citation
 Dawson, SStahl, SPaul, NBarber, JKenna, JG In vitro inhibition of the bile salt export pump correlates with risk of cholestatic drug-induced liver injury in humans. Drug Metab Dispos 40:130-8 (2011)  
Target
Name:
Bile salt export pump
Synonyms:
ABCBB_RAT Abcb11 Bile salt export pump Sister of P-glycoprotein | Spgp
Type:
PROTEIN
Mol. Mass.:
146267.86
Organism:
Rattus norvegicus
Description:
ChEMBL_1481883
Residue:
1321
  
Inhibitor
Name:
BDBM48449
Synonyms:
3-(3,4-DIHYDROXYPHENYL)-2-METHYL-L-ALANINE MLS000028644 cid_38853
Type:
Small organic molecule
Emp. Form.:
C10H13NO4
Mol. Mass.:
211.2145
SMILES:
C[C@](N)(Cc1ccc(O)c(O)c1)C(O)=O
: