Target
Aldehyde oxidase
Ligand
BDBM50241107
Substrate
Meas. Tech.
ChEMBL_1481151 (CHEMBL3537681)
Ki
1200±n/a nM
Citation
 Barr, JTJones, JP Evidence for substrate-dependent inhibition profiles for human liver aldehyde oxidase. Drug Metab Dispos 41:24-9 (2012)  
Target
Name:
Aldehyde oxidase
Synonyms:
AO AOXA_HUMAN | Aldehyde oxidase
Type:
PROTEIN
Mol. Mass.:
147930.97
Organism:
Homo sapiens (Human)
Description:
ChEMBL_1481150
Residue:
1338
  
Inhibitor
Name:
BDBM50241107
Synonyms:
1-(3-(4-(5-chloro-2-oxo-2,3-dihydrobenzo[d]imidazol-1-yl)piperidin-1-yl)propyl)-1H-benzo[d]imidazol-2(3H)-one 5-Chloro-1-{1-[3-(2-oxo-2,3-dihydro-benzoimidazol-1-yl)-propyl]-piperidin-4-yl}-1,3-dihydro-benzoimidazol-2-one(domperidone) 5-chloro-1-{1-[3-(2-oxo-2,3-dihydro-benzoimidazol-1-yl)-propyl]-piperidin-4-yl}-1,3-dihydro-benzoimidazol-2-one CHEMBL219916 DOMPERIDONE5-Chloro-1-{1-[3-(2-oxo-2,3-dihydro-benzoimidazol-1-yl)-propyl]-piperidin-4-yl}-1,3-dihydro-benzoimidazol-2-one US9132134, Domperidone
Type:
Small organic molecule
Emp. Form.:
C22H24ClN5O2
Mol. Mass.:
425.911
SMILES:
Clc1ccc2n(C3CCN(CCCn4c5ccccc5[nH]c4=O)CC3)c(=O)[nH]c2c1
: