Target
Solute carrier organic anion transporter family member 2B1
Ligand
BDBM50088491
Substrate
Meas. Tech.
ChEMBL_1494639 (CHEMBL3529889)
IC50
800±n/a nM
Citation
 Köck, KXie, YHawke, RLOberlies, NHBrouwer, KL Interaction of silymarin flavonolignans with organic anion-transporting polypeptides. Drug Metab Dispos 41:958-65 (2013)  
Target
Name:
Solute carrier organic anion transporter family member 2B1
Synonyms:
KIAA0880 OATP-RP2 OATPB Organic anion transporter B SLC21A9 SO2B1_HUMAN | Solute carrier family 21 member 9
Type:
PROTEIN
Mol. Mass.:
76729.07
Organism:
Homo sapiens (Human)
Description:
ChEMBL_1488531
Residue:
709
  
Inhibitor
Name:
BDBM50088491
Synonyms:
Silybin B
Type:
Small organic molecule
Emp. Form.:
C25H22O10
Mol. Mass.:
482.4362
SMILES:
COc1cc(ccc1O)[C@@H]1Oc2cc(ccc2O[C@H]1CO)[C@H]1Oc2cc(O)cc(O)c2C(=O)[C@@H]1O
: