Target
Nuclear receptor subfamily 1 group I member 2
Ligand
BDBM50088492
Substrate
Meas. Tech.
ChEMBL_1487568 (CHEMBL3531874)
EC50
38000±n/a nM
Citation
 Shukla, SJSakamuru, SHuang, RMoeller, TAShinn, PVanleer, DAuld, DSAustin, CPXia, M Identification of clinically used drugs that activate pregnane X receptors. Drug Metab Dispos 39:151-9 (2010)  
Target
Name:
Nuclear receptor subfamily 1 group I member 2
Synonyms:
NR1I2_RAT Nuclear receptor subfamily 1 group I member 2 Pregnane X receptor | Pxr
Type:
PROTEIN
Mol. Mass.:
49664.53
Organism:
Rattus norvegicus
Description:
ChEMBL_105143
Residue:
431
  
Inhibitor
Name:
BDBM50088492
Synonyms:
Bumecaine
Type:
Small organic molecule
Emp. Form.:
C18H28N2O
Mol. Mass.:
288.4277
SMILES:
CCCCN1CCCC1C(=O)Nc1c(C)cc(C)cc1C
: