Target
Nuclear receptor subfamily 1 group I member 2
Ligand
BDBM50088493
Substrate
Meas. Tech.
ChEMBL_1487568 (CHEMBL3531874)
EC50
9000±n/a nM
Citation
 Shukla, SJSakamuru, SHuang, RMoeller, TAShinn, PVanleer, DAuld, DSAustin, CPXia, M Identification of clinically used drugs that activate pregnane X receptors. Drug Metab Dispos 39:151-9 (2010)  
Target
Name:
Nuclear receptor subfamily 1 group I member 2
Synonyms:
NR1I2_RAT Nuclear receptor subfamily 1 group I member 2 Pregnane X receptor | Pxr
Type:
PROTEIN
Mol. Mass.:
49664.53
Organism:
Rattus norvegicus
Description:
ChEMBL_105143
Residue:
431
  
Inhibitor
Name:
BDBM50088493
Synonyms:
Diclazuril | R-64433
Type:
Small organic molecule
Emp. Form.:
C17H9Cl3N4O2
Mol. Mass.:
407.638
SMILES:
Clc1ccc(cc1)C(C#N)c1c(Cl)cc(cc1Cl)-n1ncc(=O)[nH]c1=O
: