Target
POU domain, class 2, transcription factor 1
Ligand
BDBM50228403
Substrate
Meas. Tech.
ChEMBL_1491731 (CHEMBL3536923)
IC50
45000±n/a nM
Citation
 Ishiguro, NShimizu, HKishimoto, WEbner, TSchaefer, O Evaluation and prediction of potential drug-drug interactions of linagliptin using in vitro cell culture methods. Drug Metab Dispos 41:149-58 (2012)  
Target
Name:
POU domain, class 2, transcription factor 1
Synonyms:
NF-A1 OCT1 OTF1 Octamer-binding protein 1 PO2F1_HUMAN POU2F1
Type:
PROTEIN
Mol. Mass.:
76471.70
Organism:
Homo sapiens (Human)
Description:
ChEMBL_109690
Residue:
743
  
Inhibitor
Name:
BDBM50228403
Synonyms:
(R)-8-(3-aminopiperidin-1-yl)-7-(but-2-ynyl)-3-methyl-1-((4-methylquinazolin-2-yl)methyl)-1H-purine-2,6(3H,7H)-dione CHEMBL237500 US10202383, Example 2(142) US9255098, Linagliptin US9556175, 2(142)
Type:
Small organic molecule
Emp. Form.:
C25H28N8O2
Mol. Mass.:
472.5422
SMILES:
CC#CCn1c(nc2n(C)c(=O)n(Cc3nc(C)c4ccccc4n3)c(=O)c12)N1CCC[C@@H](N)C1
: