Target
Microtubule-associated protein 2
Ligand
BDBM50088521
Substrate
Meas. Tech.
ChEMBL_1492831 (CHEMBL3527961)
EC50
12±n/a nM
Citation
 Arico-Muendel, CCBelanger, BBenjamin, DBlanchette, HSCaiazzo, TMCentrella, PADeLorey, JDoyle, EGGradhand, UGriffin, STHill, SLabenski, MTMorgan, BAO'Donovan, GPrasad, KSkinner, STaghizadeh, NThompson, CDWakefield, JWestlin, WWhite, KF Metabolites of PPI-2458, a selective, irreversible inhibitor of methionine aminopeptidase-2: structure determination and in vivo activity. Drug Metab Dispos 41:814-26 (2013)  
Target
Name:
Microtubule-associated protein 2
Synonyms:
MAP-2 MTAP2_HUMAN
Type:
PROTEIN
Mol. Mass.:
199423.64
Organism:
Homo sapiens (Human)
Description:
ChEMBL_107603
Residue:
1827
  
Inhibitor
Name:
BDBM50088521
Synonyms:
CHEMBL3527219
Type:
Small organic molecule
Emp. Form.:
C22H36N2O8
Mol. Mass.:
456.5298
SMILES:
[H][C@@]1(C[C@H]2O[C@]2(C)[C@@]2([H])[C@H](OC)[C@@H](CC[C@]22CO2)OC(=O)N[C@@H](C(N)=O)C(C)(C)O)OC1(C)C
: