Target
Protein arginine N-methyltransferase 5
Ligand
BDBM50089221
Substrate
Meas. Tech.
ChEMBL_1496150 (CHEMBL3578931)
IC50
>50000±n/a nM
Citation
 Smil, DEram, MSLi, FKennedy, SSzewczyk, MMBrown, PJBarsyte-Lovejoy, DArrowsmith, CHVedadi, MSchapira, M Discovery of a Dual PRMT5-PRMT7 Inhibitor. ACS Med Chem Lett 6:408-12 (2015)  
Target
Name:
Protein arginine N-methyltransferase 5
Synonyms:
72 kDa ICln-binding protein HRMT1L5 IBP72 Jak-binding protein 1 PRMT5/MEP50 complex Protein arginine methyltransferase 5 (PRMT5) SKB1 homolog Shk1 kinase-binding protein 1 homolog
Type:
Enzyme
Mol. Mass.:
72679.99
Organism:
Homo sapiens (Human)
Description:
O14744
Residue:
637
  
Inhibitor
Name:
BDBM50089221
Synonyms:
CHEMBL3577854
Type:
Small organic molecule
Emp. Form.:
C15H23N7O4S
Mol. Mass.:
397.453
SMILES:
CCNC(=O)NCCSC[C@H]1O[C@H]([C@H](O)[C@@H]1O)n1cnc2c(N)ncnc12
: